{"text_format":"1","workbook":"xlsx","n_sheets":7,"sheets":["License Key Order Form ","NAV Granule Explanation","Competitive","Products","Countries2","Instructions","Sheet1"],"not_rendered":{"charts":0,"images":1,"macros":1,"external_links":0,"defined_names":43,"comments":0,"pivot_tables":0},"unopened":[],"bounds":{"document_bytes":16777216,"sheet_cells":100000,"rows_first":2000,"rows_last":500,"rows_between":2000,"halvings":0,"cell_chars":16384,"cell_head_chars":4096},"cells_cut":0,"cells_raw":0,"read":"whole","date_system":"1900"}

{"sheet":"License Key Order Form ","index":0,"n_rows":34,"n_cols":7,"rows_kept":34,"cut":false,"hidden":false,"merged":[[32,1,32,7],[31,1,31,7],[33,1,33,7],[13,1,13,7],[1,1,1,7],[12,1,12,7],[14,1,14,3],[19,1,19,3],[30,1,30,7],[11,1,11,3],[3,5,4,6],[14,5,14,7]]}
[]
[null,"Global Microsoft Dynamics \"Test/Evaluation License Key\" for Customer and Partner Prospects"]
[null,null,null,null,null,"EOC:"]
[null,null,null,null,null,"Please submit orders via CLT to the Regional Operations Centre : "]
[]
[null,null,null,null,null,"Navigate to PartnerSource>>Contact Us>>Operations Support"]
[null,null,null,null,null,"AOC:"]
[null,null,null,null,null,"Please submit orders via VSA to the Regional Operations Center : "]
[null,null,null,null,null,"Navigate to PartnerSource>>Contact Us>>Operations Support"]
[null,null,null,null,null,"APOC: "]
[null,null,null,null,null,"Please submit orders to the following address:  ","mbslques@microsoft.com"]
[null,"Please select the Prospect Type:",null,null,false,2]
[null,"Instructions (Please Read):"]
[null,{"$f":"IF(F12=1,Instructions!A5,Instructions!A2)","v":"1.  This order form should be used by partners to submit a request for a \"Test/Evaluation License Key\" on behalf of a customer prospect.       \n2.  This order form should be completed and submitted only by Microsoft Dynamics partners. The partner is accountable for correct usage.       \n3.  Mandatory fields are underlined, failure to provide all mandatory fields may result in delays.       \n4.  Alterations to the format of this coversheet may result in delays or non-acceptance.\n5.  Please provide a detailed Business Justification if this is a license renewal"}]
[null,{"$f":"IF(F12=1,\"Partner Engagement Manager Details:\",\"Partner Details:\")","v":"Partner Details:"},null,null,null,"Order Details:"]
[]
[null,{"$f":"IF(F12=1,\"PEM Name:\",\"Partner Name:\")","v":"Partner Name:"},null,"LS Retail",null,"Product:",2]
[null,{"$f":"IF(F12=1,\"Subsidiary:\",\"Partner VOICE Account Number:\")","v":"Partner VOICE Account Number:"},null,null,null,"NAV Localisation:","W1"]
[null,null,null,null,null,"Order Date:"]
[null,{"$f":"IF(F12=1,\"Partner Evaluation/Test License Details:\",\"Customer Prospect Evaluation/Test License Details:\")","v":"Customer Prospect Evaluation/Test License Details:"},null,null,null," - License key can only be renewed once (120 days)"]
[null,null,null,null,null," - 20 Users are included in the license"]
[null,"Name:"]
[null,"Address:"]
[null,"Address 2:"]
[null,"City:"]
[null,"County:"]
[null,"Country:",null,"Afghanistan - AF"]
[null,"Contact Name:"]
[null,"Email:"]
[null,null,null,{"$f":"IF(B32=\"\",\"NONE\",\"\")","v":""}]
[null,"Business Justification: List additional business justification required below:"]
[null,"The partner needs an test license for LS Nav 2015 to demonstrate to customer LS Nav 2015"]
[null,"Additional Comments:"]
[null,"Please add granules 10000700, 10012200, 10014720,10015010, 10014910"]

{"sheet":"NAV Granule Explanation","index":1,"n_rows":84,"n_cols":5,"rows_kept":84,"cut":false,"hidden":true,"merged":[]}
["Base Granules for the \"006 - Test/Evaluation License Key\""]
["Granule ID","Granule Description","Included Granule","Granule Description"]
[580,"External Test License",920,"Country Specific Object Permissions"]
[null,null,930,"Unused Application Objects"]
[null,null,1100,"Company"]
[null,null,1200,"Session"]
[null,null,1310,"Database Expansion per 1 MB"]
[null,null,1400,"User IDs & Passwords"]
[null,null,1410,"Permissions"]
[null,null,1420,"Application Server"]
[null,null,1500,"Server - Any"]
[null,null,2010,"Server - Microsoft SQL Server Option"]
[null,null,2020,"Per Database license"]
[null,null,2105," Allow new versions"]
[null,null,2110,"Navision Attain 3.0 and 3.01"]
[null,null,2200,"Connector for Siebel eBusiness - Financials"]
[null,null,3000,"General Ledger"]
[null,null,3250,"Sales & Receivables"]
[null,null,3410,"Sales Tax"]
[null,null,3500,"Purchases & Payables "]
[null,null,3750,"Application Wide"]
[null,null,4000,"Inventory"]
[null,null,4250,"Resources"]
[null,null,4500,"Jobs"]
[null,null,4900,"Application Wide     - Multiple System Languages"]
[null,null,5000,"Cash Manager"]
[null,null,5100,"CRM"]
[null,null,5250,"Fixed Assets"]
[null,null,5500,"Contact Management"]
[null,null,5750,"Human Resources"]
[null,null,5900,"CRM - Service"]
[null,null,100000,"Translation Tool"]
[null,null,101000,"Demonstration Data Tool"]
[null,null,104000,"Upgrade Toolkit Execute objects(104,000-104,199)"]
[null,null,150000,"Performance Troubleshooting Execute"]
[null,null,160001,"Country Demo objects Execute 160.000-169.999"]
[null,null,170001,"Country Upgrade objects Execute 170.000-189.999"]
[]
[620,"Product Specialist",7200,"Application Builder","Please note, no development done with this \"006 - Test/Evaluation License Key\" can be used commercially."]
[null,null,102100,"Navision Financials Conversion + Compare Toolkit"]
[]
[630,"Solution Developer",7300,"Solution Developer","Please note, no development done with this \"006 - Test/Evaluation License Key\" can be used commercially."]
[]
["Other orderable granules for the \"006 - Test/Evaluation License Key\""]
["Granule ID","Granule Description"]
[140,"Text Export/Text Import"]
[922,"Custom Area Objects Demo"]
[1370,"Database Expansion per 1 GB"]
[1375,"Database Expansion per 1 GB special"]
[1450,"VIP - Integration Brooker"]
[1900,"Cross-Reference Tool"]
[4021,"TEST Application Wide-Multiple Document Languages"]
[4935,"Application Wide - Afrikaans"]
[4943,"Application Wide - Arabic (Lebanon)"]
[4973,"Application Wide - Serbian (Latin)"]
[4974,"Application Wide - Slovak"]
[6730,"User Portal - Product Design Activity Center"]
[6760,"Product Design Activity Center for version 3.XX"]
[7100,"Level 1:Design"]
[8200,"Application Objects  - Tables    (10)"]
[8300,"Application Objects  - Forms     (100)"]
[8400,"Application Objects  - Reports   (100)"]
[8500,"Application Objects  - Dataports (100)"]
[8600,"Application Objects  - Codeunits (100)"]
[99001451,"Retail NSC Execute Objects"]
[99001902,"Distribution NSC Execute(99,001,900 - 99,003,099)"]
[99003502,"W1 NDP Execute objects (99,003,500-99,003,599)"]
[99003700,"OnTarget Modeler"]
[99003710,"OnTarget - Business Modeling"]
[99003802,"Manufacturing (99.003.800 - 99.003.899) NSC"]
[99003902,"W1 NDP Execute objects (99,003,900-99,004,399)"]
[99004881,"Business Analytics - Windows Viewer"]
[99004882,"Business Analytics - Web Viewer"]
[99004883,"Business Analytics - Client Per User"]
[99004884,"Business Analytics - Web Only Client per user"]
[99004902,"ZF Friedrichshafen Execute(99,004,900-99,005,399)"]
[99005402,"Wacker-Chemie Execute NSC(99,005,400-99,005,899)"]
[99006502,"ADP Dealer Ser.Execute(99,006,500-99,006,999)"]
[99007102,"SCI Sales Channel Infrastructure - Execute"]
[99007802,"Wilo-Salmson Execute (99,007,800-99,008,299)"]
[99009702,"Adidas Retail Execute (99,009,700-99,009,899)"]
[99009902,"Caradon NSC Execute (99,009,900-99,010,099)"]
[99011662,"Linde Execute (99,011,660-99,012,059)"]
[99999910,"W1 System Permissions"]

{"sheet":"Competitive","index":2,"n_rows":143,"n_cols":1,"rows_kept":143,"cut":false,"hidden":true,"merged":[]}
["Access"]
["Accountview"]
["ACCPAC"]
["Accpac SQL"]
["ACT"]
["Adonix"]
["Afas"]
["Aggresso"]
["Alpha"]
["Apertum"]
["AP-Software"]
["Aqua"]
["Ares"]
["AS/400"]
["Astea"]
["Aster"]
["Attache"]
["Bäurer"]
["Baan"]
["BIM"]
["Brain"]
["BusinessWorks"]
["CCMX"]
["CCS"]
["Cegid"]
["Cezanne"]
["Clarify"]
["Comet"]
["Comet/ALX"]
["Computer Associates"]
["DacEasy"]
["Damgaard - Axapta"]
["Damgaard - Concorde C5"]
["Damgaard - Concorde Light"]
["Damgaard - Concorde XAL"]
["DB2"]
["Dialog"]
["Dream"]
["Ekilan"]
["Epicor"]
["Ergosoft"]
["Espro"]
["Eware"]
["Exact"]
["Exchequer"]
["Exploit"]
["Facts"]
["Field Pro"]
["Fourth Shift"]
["Gambit"]
["Generix"]
["GenesisWorld"]
["Goldmine"]
["Great Elk"]
["Great Plains"]
["Great Planes Dynamics C/S+"]
["Grote Beer"]
["HS - Hamburger Software"]
["I2"]
["IBS"]
["IFS"]
["Impact"]
["Infor"]
["Intentia"]
["InterBiz (CA)"]
["Interlociciel"]
["Intershop"]
["JBA"]
["JD Edwards"]
["Jeeves"]
["Jiwa"]
["Kaufman"]
["KHK"]
["Kopa"]
["Krmar"]
["Lakeview"]
["Lawson"]
["LCS International (local)"]
["Lilly"]
["Lotus (workflow tools)"]
["Macola"]
["Maconomy"]
["Made2Manage"]
["Magic"]
["Maop"]
["Mesonic"]
["MFG/PRO"]
["Micro 80"]
["MS BO"]
["MSG Pro"]
["Netledger"]
["Octane"]
["Onyx"]
["Openshop"]
["Oracle"]
["Oracle Financials"]
["Other"]
["Peachtree, MAS 90/200"]
["Pegasus"]
["PeopleSoft"]
["Phc (local)"]
["Pinnacle"]
["Pivotal"]
["Platinum SQL"]
["PPU Maconomy"]
["proAlpha"]
["Pronto"]
["Prophet 21"]
["QAD MFGPRO"]
["QuickArrow"]
["Remedy"]
["Rubicon"]
["Sage - Saari"]
["Sage - Sovereign"]
["Sage - Sybel"]
["Sage CS/3"]
["Sage Enterprise"]
["Sage Enterprise Suite"]
["Sage Line 200"]
["Sage Premier"]
["Sage Web Enterprise"]
["Sales Logix"]
["Saop"]
["SAP"]
["Scala"]
["Sicom-SQL Finance"]
["Siebel"]
["Solomon"]
["Strategix"]
["Sun"]
["SuperOffice"]
["Symix"]
["Systems Union - Sun"]
["Szymaniak"]
["Technology One"]
["Tera"]
["Tesseract"]
["Tetra"]
["Unit 4"]
["Update.com"]
["Vantive"]
["Visma Business"]
["Visual Mfg."]

{"sheet":"Products","index":3,"n_rows":10,"n_cols":1,"rows_kept":10,"cut":false,"hidden":true,"merged":[]}
["Apertum"]
["Dynamics AX"]
["C5"]
["C5 Light"]
["Enterprise Reporting"]
["Dynamics GP"]
["Dynamics NA"]
["RMS"]
["Dynamics SL"]
["XAL"]

{"sheet":"Countries2","index":4,"n_rows":240,"n_cols":7,"rows_kept":240,"cut":false,"hidden":true,"merged":[]}
["Australia - AU","Australia - AU",null,"Argentina - AR",null,null,"Afghanistan - AF"]
["Austria - AT","Austria - AT",null,"Australia - AU",null,null,"Albania - AL"]
["Belgium - BE","Belgium - BE",null,"Austria - AT",null,null,"Algeria - DZ"]
["Canada - CA","Canada - CA",null,"Belgium - BE",null,null,"American Samoa - AS"]
["Czech Republic - CZ","Denmark - DK",null,"Bulgaria - BG",null,null,"Andorra - AD"]
["Denmark - DK","Finland - FI",null,"Canada - CA",null,null,"Angola - AO"]
["Finland - FI","France - FR",null,"Croatia - HR",null,null,"Anguilla - AI"]
["France - FR","Germany - DE",null,"Cyprus - CY",null,null,"Antarctica - AQ"]
["Germany - DE","Great Britain - GB",null,"Czech Republic - CZ",null,null,"Antigua and Barbuda - AG"]
["Great Britain - GB","Iceland - IS",null,"Denmark - DK",null,null,"Argentina - AR"]
["Iceland - IS","Italy - IT",null,"Estonia - EE",null,null,"Armenia - AM"]
["India - IN","Mexico - MX",null,"Finland - FI",null,null,"Aruba - AW"]
["Italy - IT","Netherlands - NL",null,"France - FR",null,null,"Australia - AU"]
["Mexico - MX","New Zealand - NZ",null,"Germany - DE",null,null,"Austria - AT"]
["Netherlands - NL","Norway - NO",null,"Great Britain - GB",null,null,"Azerbaijan - AZ"]
["New Zealand - NZ","Russia - RU",null,"Greece - GR",null,null,"Bahamas - BS"]
["Norway - NO","Spain - ES",null,"Hungary - HU",null,null,"Bahrain - BH"]
["Russia - RU","Sweden - SE",null,"Iceland - IS",null,null,"Bangladesh - BD"]
["Spain - ES","Switzerland - CH",null,"India - IN",null,null,"Barbados - BB"]
["Sweden - SE","United States - US",null,"Indonesia - ID",null,null,"Belarus - BY"]
["Switzerland - CH","W1",null,"Ireland - IE",null,null,"Belgium - BE"]
["United States - US",null,null,"Italy - IT",null,null,"Belize - BZ"]
["W1",null,null,"Latvia - LV",null,null,"Benin - BJ"]
[null,null,null,"Lithuania - LT",null,null,"Bermuda - BM"]
[null,null,null,"Malaysia - MY",null,null,"Bhutan - BT"]
[null,null,null,"Malta - MT",null,null,"Bolivia - BO"]
[null,null,null,"Mexico - MX",null,null,"Bosnia and Herzegovina - BA"]
[null,null,null,"Middle East - ME",null,null,"Botswana - BW"]
[null,null,null,"Netherlands - NL",null,null,"Bouvet Island - BV"]
[null,null,null,"New Zealand - NZ",null,null,"Brazil - BR"]
[null,null,null,"North Africa - NA",null,null,"British Indian Ocean Territories - IO"]
[null,null,null,"Norway - NO",null,null,"Brunei Darussalam - BN"]
[null,null,null,"Philippines - PH",null,null,"Bulgaria - BG"]
[null,null,null,"Poland - PL",null,null,"Burkina Faso - BF"]
[null,null,null,"Portugal - PT",null,null,"Burundi - BI"]
[null,null,null,"Romania - RO",null,null,"Cambodia - KH"]
[null,null,null,"Russia - RU",null,null,"Cameroon - CM"]
[null,null,null,"Serbia and Montenegro - CS",null,null,"Canada - CA"]
[null,null,null,"Singapore - SG",null,null,"Cape Verde - CV"]
[null,null,null,"Slovakia - SK",null,null,"Cayman Islands - KY"]
[null,null,null,"Slovenia - SI",null,null,"Central African Republic - CF"]
[null,null,null,"South Africa - ZA",null,null,"Chad - TD"]
[null,null,null,"Spain - ES",null,null,"Chile - CL"]
[null,null,null,"Sweden - SE",null,null,"China - CN"]
[null,null,null,"Switzerland - CH",null,null,"Christmas Island - CX"]
[null,null,null,"Thailand - TH",null,null,"Cocos Islands - CC"]
[null,null,null,"Turkey - TR",null,null,"Colombia - CO"]
[null,null,null,"United States - US",null,null,"Comoros - KM"]
[null,null,null,"W1",null,null,"Congo - CG"]
[null,null,null,"WECA",null,null,"Congo, The Democratic Republic of the - CD"]
[null,null,null,null,null,null,"Cook Islands - CK"]
[null,null,null,null,null,null,"Costa Rica - CR"]
[null,null,null,null,null,null,"Cote D'ivoire - CI"]
[null,null,null,null,null,null,"Croatia - HR"]
[null,null,null,null,null,null,"Cuba - CU"]
[null,null,null,null,null,null,"Cyprus - CY"]
[null,null,null,null,null,null,"Czech Republic - CZ"]
[null,null,null,null,null,null,"Democratic People's Republic of Korea - KP"]
[null,null,null,null,null,null,"Denmark - DK"]
[null,null,null,null,null,null,"Djibouti - DJ"]
[null,null,null,null,null,null,"Dominica - DM"]
[null,null,null,null,null,null,"Dominican Republic - DO"]
[null,null,null,null,null,null,"Ecuador - EC"]
[null,null,null,null,null,null,"Egypt - EG"]
[null,null,null,null,null,null,"El Salvador - SV"]
[null,null,null,null,null,null,"Equatorial Guinea - GQ"]
[null,null,null,null,null,null,"Eritrea - ER"]
[null,null,null,null,null,null,"Estonia - EE"]
[null,null,null,null,null,null,"Ethiopia - ET"]
[null,null,null,null,null,null,"Falkland Islands - FK"]
[null,null,null,null,null,null,"Faroe Islands - FO"]
[null,null,null,null,null,null,"Fiji - FJ"]
[null,null,null,null,null,null,"Finland - FI"]
[null,null,null,null,null,null,"France - FR"]
[null,null,null,null,null,null,"France, Metropolitan - FX"]
[null,null,null,null,null,null,"French Guiana - GF"]
[null,null,null,null,null,null,"French Polynesia - PF"]
[null,null,null,null,null,null,"French Southern Territories - TF"]
[null,null,null,null,null,null,"Gabon - GA"]
[null,null,null,null,null,null,"Gambia - GM"]
[null,null,null,null,null,null,"Georgia - GE"]
[null,null,null,null,null,null,"Germany - DE"]
[null,null,null,null,null,null,"Ghana - GH"]
[null,null,null,null,null,null,"Gibraltar - GI"]
[null,null,null,null,null,null,"Greece - GR"]
[null,null,null,null,null,null,"Greenland - GL"]
[null,null,null,null,null,null,"Grenada - GD"]
[null,null,null,null,null,null,"Guadeloupe - GP"]
[null,null,null,null,null,null,"Guam - GU"]
[null,null,null,null,null,null,"Guatemala - GT"]
[null,null,null,null,null,null,"Guinea - GN"]
[null,null,null,null,null,null,"Guinea-Bissau - GW"]
[null,null,null,null,null,null,"Guyana - GY"]
[null,null,null,null,null,null,"Haiti - HT"]
[null,null,null,null,null,null,"Heard Island And Mcdonald Islands - HM"]
[null,null,null,null,null,null,"Holy See (Vatican City State) - VA"]
[null,null,null,null,null,null,"Honduras - HN"]
[null,null,null,null,null,null,"Hong Kong - HK"]
[null,null,null,null,null,null,"Hungary - HU"]
[null,null,null,null,null,null,"Iceland - IS"]
[null,null,null,null,null,null,"India - IN"]
[null,null,null,null,null,null,"Indonesia - ID"]
[null,null,null,null,null,null,"Iran - IR"]
[null,null,null,null,null,null,"Iraq - IQ"]
[null,null,null,null,null,null,"Ireland - IE"]
[null,null,null,null,null,null,"Israel - IL"]
[null,null,null,null,null,null,"Italy - IT"]
[null,null,null,null,null,null,"Jamaica - JM"]
[null,null,null,null,null,null,"Japan - JP"]
[null,null,null,null,null,null,"Jordan - JO"]
[null,null,null,null,null,null,"Kazakhstan - KZ"]
[null,null,null,null,null,null,"Kenya - KE"]
[null,null,null,null,null,null,"Kiribati - KI"]
[null,null,null,null,null,null,"Kuwait - KW"]
[null,null,null,null,null,null,"Kyrgyzstan - KG"]
[null,null,null,null,null,null,"Lao Peoples Democratic Republic - LA"]
[null,null,null,null,null,null,"Latvia - LV"]
[null,null,null,null,null,null,"Lebanon - LB"]
[null,null,null,null,null,null,"Lesotho - LS"]
[null,null,null,null,null,null,"Liberia - LR"]
[null,null,null,null,null,null,"Libyan Arab Jamahiriya - LY"]
[null,null,null,null,null,null,"Liechtenstein - LI"]
[null,null,null,null,null,null,"Lithuania - LT"]
[null,null,null,null,null,null,"Luxembourg - LU"]
[null,null,null,null,null,null,"Macao - MO"]
[null,null,null,null,null,null,"Macedonia - MK"]
[null,null,null,null,null,null,"Madagascar - MG"]
[null,null,null,null,null,null,"Malawi - MW"]
[null,null,null,null,null,null,"Malaysia - MY"]
[null,null,null,null,null,null,"Maldives - MV"]
[null,null,null,null,null,null,"Mali - ML"]
[null,null,null,null,null,null,"Malta - MT"]
[null,null,null,null,null,null,"Marshall Islands - MH"]
[null,null,null,null,null,null,"Martinique - MQ"]
[null,null,null,null,null,null,"Mauritania - MR"]
[null,null,null,null,null,null,"Mauritius - MU"]
[null,null,null,null,null,null,"Mayotte - YT"]
[null,null,null,null,null,null,"Mexico - MX"]
[null,null,null,null,null,null,"Micronesia - FM"]
[null,null,null,null,null,null,"Moldova - MD"]
[null,null,null,null,null,null,"Monaco - MC"]
[null,null,null,null,null,null,"Mongolia - MN"]
[null,null,null,null,null,null,"Montserrat - MS"]
[null,null,null,null,null,null,"Morocco - MA"]
[null,null,null,null,null,null,"Mozambique - MZ"]
[null,null,null,null,null,null,"Myanmar - MM"]
[null,null,null,null,null,null,"Namibia - NA"]
[null,null,null,null,null,null,"Nauru - NR"]
[null,null,null,null,null,null,"Nepal - NP"]
[null,null,null,null,null,null,"Netherlands - NL"]
[null,null,null,null,null,null,"Netherlands Antilles - AN"]
[null,null,null,null,null,null,"New Caledonia - NC"]
[null,null,null,null,null,null,"New Zealand - NZ"]
[null,null,null,null,null,null,"Nicaragua - NI"]
[null,null,null,null,null,null,"Niger - NE"]
[null,null,null,null,null,null,"Nigeria - NG"]
[null,null,null,null,null,null,"Niue - NU"]
[null,null,null,null,null,null,"Norfolk Island - NF"]
[null,null,null,null,null,null,"Northern Mariana Islands - MP"]
[null,null,null,null,null,null,"Norway - NO"]
[null,null,null,null,null,null,"Occupied Palestinian Territory - PS"]
[null,null,null,null,null,null,"Oman - OM"]
[null,null,null,null,null,null,"Pakistan - PK"]
[null,null,null,null,null,null,"Palau - PW"]
[null,null,null,null,null,null,"Panama - PA"]
[null,null,null,null,null,null,"Papua New Guinea - PG"]
[null,null,null,null,null,null,"Paraguay - PY"]
[null,null,null,null,null,null,"Peru - PE"]
[null,null,null,null,null,null,"Philippines - PH"]
[null,null,null,null,null,null,"Pitcairn - PN"]
[null,null,null,null,null,null,"Poland - PL"]
[null,null,null,null,null,null,"Portugal - PT"]
[null,null,null,null,null,null,"Puerto Rico - PR"]
[null,null,null,null,null,null,"Qatar - QA"]
[null,null,null,null,null,null,"Republic of Korea - KR"]
[null,null,null,null,null,null,"Reunion - RE"]
[null,null,null,null,null,null,"Romania - RO"]
[null,null,null,null,null,null,"Russian Federation - RU"]
[null,null,null,null,null,null,"Rwanda - RW"]
[null,null,null,null,null,null,"Saint Helena - SH"]
[null,null,null,null,null,null,"Saint Kitts and Nevis - KN"]
[null,null,null,null,null,null,"Saint Lucia - LC"]
[null,null,null,null,null,null,"Saint Pierre and Miquelon - PM"]
[null,null,null,null,null,null,"Saint Vincent and The Grenadines - VC"]
[null,null,null,null,null,null,"Samoa - WS"]
[null,null,null,null,null,null,"San Marino - SM"]
[null,null,null,null,null,null,"Sao Tome and Principe - ST"]
[null,null,null,null,null,null,"Saudi Arabia - SA"]
[null,null,null,null,null,null,"Senegal - SN"]
[null,null,null,null,null,null,"Serbia and Montenegro - CS"]
[null,null,null,null,null,null,"Seychelles - SC"]
[null,null,null,null,null,null,"Sierra Leone - SL"]
[null,null,null,null,null,null,"Singapore - SG"]
[null,null,null,null,null,null,"Slovakia - SK"]
[null,null,null,null,null,null,"Slovenia - SI"]
[null,null,null,null,null,null,"Solomon Islands - SB"]
[null,null,null,null,null,null,"Somalia - SO"]
[null,null,null,null,null,null,"South Africa - ZA"]
[null,null,null,null,null,null,"South Georgia and the South Sandwich Islands - GS"]
[null,null,null,null,null,null,"Spain - ES"]
[null,null,null,null,null,null,"Sri Lanka - LK"]
[null,null,null,null,null,null,"Sudan - SD"]
[null,null,null,null,null,null,"Suriname - SR"]
[null,null,null,null,null,null,"Svalbard and Jan Mayen Islands - SJ"]
[null,null,null,null,null,null,"Swaziland - SZ"]
[null,null,null,null,null,null,"Sweden - SE"]
[null,null,null,null,null,null,"Switzerland - CH"]
[null,null,null,null,null,null,"Syrian Arab Republic - SY"]
[null,null,null,null,null,null,"Taiwan - TW"]
[null,null,null,null,null,null,"Tajikistan - TJ"]
[null,null,null,null,null,null,"Tanzania - TZ"]
[null,null,null,null,null,null,"Thailand - TH"]
[null,null,null,null,null,null,"Timor-Leste - TL"]
[null,null,null,null,null,null,"Togo - TG"]
[null,null,null,null,null,null,"Tokelau - TK"]
[null,null,null,null,null,null,"Tonga - TO"]
[null,null,null,null,null,null,"Trinidad and Tobago - TT"]
[null,null,null,null,null,null,"Tunisia - TN"]
[null,null,null,null,null,null,"Turkey - TR"]
[null,null,null,null,null,null,"Turkmenistan - TM"]
[null,null,null,null,null,null,"Turks and Caicos Islands - TC"]
[null,null,null,null,null,null,"Tuvalu - TV"]
[null,null,null,null,null,null,"Uganda - UG"]
[null,null,null,null,null,null,"Ukraine - UA"]
[null,null,null,null,null,null,"United Arab Emirates - AE"]
[null,null,null,null,null,null,"United Kingdom - GB"]
[null,null,null,null,null,null,"United States - US"]
[null,null,null,null,null,null,"United States Minor Outlying Islands - UM"]
[null,null,null,null,null,null,"Uruguay - UY"]
[null,null,null,null,null,null,"Uzbekistan - UZ"]
[null,null,null,null,null,null,"Vanuatu - VU"]
[null,null,null,null,null,null,"Venezuela - VE"]
[null,null,null,null,null,null,"Viet Nam - VN"]
[null,null,null,null,null,null,"Virgin Islands (British) - VG"]
[null,null,null,null,null,null,"Virgin Islands (U.S.) - VI"]
[null,null,null,null,null,null,"Wallis And Futuna Islands - WF"]
[null,null,null,null,null,null,"Western Sahara - EH"]
[null,null,null,null,null,null,"Yemen - YE"]
[null,null,null,null,null,null,"Zambia - ZM"]
[null,null,null,null,null,null,"Zimbabwe - ZW"]

{"sheet":"Instructions","index":5,"n_rows":22,"n_cols":1,"rows_kept":22,"cut":false,"hidden":true,"merged":[]}
["Customer"]
["1.  This order form should be used by partners to submit a request for a \"Test/Evaluation License Key\" on behalf of a customer prospect.       \n2.  This order form should be completed and submitted only by Microsoft Dynamics partners. The partner is accountable for correct usage.       \n3.  Mandatory fields are underlined, failure to provide all mandatory fields may result in delays.       \n4.  Alterations to the format of this coversheet may result in delays or non-acceptance.\n5.  Please provide a detailed Business Justification if this is a license renewal"]
[]
["Partner "]
["1.  This order form should be used by Partner Engagement Managers (PEM) to submit a request for a \"Test/Evaluation License Key\" on behalf of a partner prospect.       \n2.  This order form should be completed and submitted only by subsidiary PEMs on behalf of their partner prospect.       \n3.  By you, the PEM, entering your contact details below, you are authorising the partner to receive the license key. You are accountable for correct usage.       \n4.  Mandatory fields are underlined, failure to provide all mandatory fields may result in delays.       \n5.  Alterations to the format of this coversheet may result in delays or non-acceptance.\n6.  Please provide a detailed Business Justification if this is a license renewal"]
[]
[]
[]
[]
[]
[]
[]
[]
[]
["Please Select Product"]
["Microsoft Dynamics AX 2012"]
["Microsoft Dynamics NAV 2015"]
["Microsoft Dynamics NAV 2013 R2"]
["Microsoft Dynamics NAV 2009"]
[]
["Partner Prospect"]
["Customer Prospect"]

{"sheet":"Sheet1","index":6,"n_rows":0,"n_cols":0,"rows_kept":0,"cut":false,"hidden":true,"merged":[]}