{"text_format":"1","workbook":"xlsx","n_sheets":10,"sheets":["Order Form"," Monthly LS Central on BC SaaS","LS Central on BC SaaS edit","BTC2 Computation","Change Log ","FactorOld","Factor","Price List","Lists","Change Log"],"not_rendered":{"charts":0,"images":6,"macros":1,"external_links":4,"defined_names":49,"comments":6,"pivot_tables":0},"unopened":[],"bounds":{"document_bytes":16777216,"sheet_cells":100000,"rows_first":2000,"rows_last":500,"rows_between":2000,"halvings":0,"cell_chars":16384,"cell_head_chars":4096},"cells_cut":0,"cells_raw":0,"read":"whole","date_system":"1900"}

{"sheet":"Order Form","index":0,"n_rows":58,"n_cols":4,"rows_kept":58,"cut":false,"hidden":true,"merged":[[55,0,55,9],[52,0,52,9],[17,3,17,9],[46,3,46,4],[46,5,46,8],[54,0,54,9],[53,0,53,9]]}
["How to order:"]
[null,"Submission Details: e-mail all orders to licenses@lsretail.com or submit a request via JIRA "]
[]
[]
[null,"In order to ensure the fastest order processing, the following completed Order Form is now required for all eligible orders to LS Retail:"]
[null,"1.  Orders received on out-of-date pricelists will not be processed and will be returned to the sender for correction."]
[null,"2.  Underlined fields in RED are mandatory."]
[null,"3.  Alterations to the format of this coversheet may result in delays or non-acceptance."]
[null,"4.  To submit the order, please fill out this form and email to licenses@lsretail.com or submit a request via JIRA."]
[null,"5.  This order may not be processed if your account has overdue balances or you have exceeded your credit limit. "]
{"$rows_left_out":49}
{"sheet":" Monthly LS Central on BC SaaS","index":1,"n_rows":83,"n_cols":12,"rows_kept":83,"cut":false,"hidden":true,"merged":[[52,8,52,10],[53,8,53,10],[54,8,54,10],[60,9,60,10],[43,8,43,10],[44,8,44,10],[49,8,49,10],[50,8,50,10],[51,8,51,10],[57,8,57,10],[58,8,58,10],[55,8,55,10],[56,8,56,10],[48,8,48,10],[33,9,33,10],[37,8,37,10],[38,8,38,10],[39,8,39,10],[42,8,42,10],[40,8,40,10],[82,1,82,9],[76,1,76,10],[77,1,77,10],[78,1,78,10],[80,1,80,9],[74,3,74,6],[2,6,7,8],[13,8,13,10],[14,9,14,10],[15,9,15,10],[16,9,16,10],[17,9,17,10],[18,9,18,10],[28,8,28,10],[29,8,29,10],[19,9,19,10],[26,8,26,10],[27,8,27,10],[32,8,32,10],[74,8,74,10],[59,9,59,10],[31,8,31,10],[30,8,30,10],[0,9,0,10],[22,8,22,10],[0,1,0,3],[23,8,23,10],[25,8,25,10],[20,9,20,10],[24,8,24,9],[21,8,21,10]]}
[null," LS Central on Business Central SaaS Price Quote Sheet",null,null,null,null,null,{"$f":"\"Effective from \"&TEXT(Lists!L18,\"dd.mm.yyyy\")","v":"Effective from Effective from 1 September 2023"},null,"LS Retail Confidential"]
[]
[]
[null,{"$f":"\"Customer Location:  \"","v":"Customer Location:  "},"United States"]
[null,{"$f":"\"Country Code:  \"","v":"Country Code:  "},"W1"]
[null,{"$f":"\"Customer Region:  \"","v":"Customer Region:  "},{"$f":"FactorOld!C1","v":"NAOM"}]
[]
[]
[null,null,null,null,null,null,"Subscription Term","Monthly"]
[null,{"$f":"\"Currency:  \"","v":"Currency:  "},"USD",null,null,null,"Mode of Billing","Monthly"]
{"$rows_left_out":74}
{"sheet":"LS Central on BC SaaS edit","index":2,"n_rows":116,"n_cols":21,"rows_kept":116,"cut":false,"hidden":true,"merged":[[0,1,0,3],[0,9,0,15],[1,11,1,12],[2,7,3,9],[30,9,30,15],[23,9,23,15],[12,9,12,15],[13,9,13,15],[14,9,14,15],[15,9,15,15],[16,9,16,15],[17,9,17,15],[18,9,18,15],[19,9,19,15],[20,9,20,15],[21,9,21,15],[51,9,51,15],[22,9,22,15],[49,9,49,15],[50,9,50,15],[43,9,43,15],[44,9,44,15],[47,9,47,15],[48,9,48,15],[24,9,24,15],[32,9,32,15],[33,9,33,15],[39,9,39,15],[40,9,40,15],[37,9,37,15],[38,9,38,15],[25,9,25,15],[26,9,26,15],[27,9,27,15],[41,9,41,15],[42,9,42,15],[28,9,28,15],[29,9,29,15],[31,9,31,15],[96,11,96,12],[75,1,75,15],[76,1,76,15],[78,1,78,9],[80,1,80,9],[74,1,74,15],[57,9,57,15],[58,9,58,15],[56,9,56,15],[52,9,52,15],[54,9,54,15],[55,9,55,15],[72,3,72,6],[53,9,53,18],[72,9,72,15]]}
[null," LS Central on Business Central SaaS Price Quote Sheet",null,null,null,{"$f":"\"Effective from \"&TEXT(Lists!L18,\"dd.mm.yyyy\")","v":"Effective from Effective from 1 September 2023"},null,null,null,"LS Retail Confidential"]
[null,null,null,null,null,null,null,null,null,"Please see this link for the latest information and country availability details"]
[null,"Subscription Term:","Monthly"]
[null,"Mode of Billing:","Monthly"]
[null,{"$f":"\"Currency:\"","v":"Currency:"},"USD",null,null,null,null,"Partner discount Subscription/SaaS:"]
[]
[]
[]
[]
[]
{"$rows_left_out":107}
{"sheet":"BTC2 Computation","index":3,"n_rows":104,"n_cols":29,"rows_kept":104,"cut":false,"hidden":false,"merged":[[2,26,2,27],[4,5,4,8],[69,10,69,16],[96,1,96,16],[97,1,97,16],[55,10,55,16],[56,10,56,16],[57,10,57,16],[58,10,58,16],[59,10,59,16],[52,10,52,16],[53,10,53,16],[41,10,41,16],[42,10,42,16],[43,10,43,16],[44,10,44,16],[63,10,63,16],[66,10,66,16],[76,10,76,16],[70,10,70,16],[71,10,71,16],[72,10,72,16],[73,10,73,16],[74,10,74,16],[75,10,75,16],[67,10,67,16],[48,10,48,16],[28,10,28,16],[27,10,27,16],[102,1,102,10],[77,10,77,16],[78,10,78,16],[79,10,79,16],[80,10,80,16],[94,10,94,16],[95,1,95,10],[100,1,100,10],[98,1,98,16],[65,10,65,16],[64,10,64,16],[60,10,60,16],[68,10,68,16],[54,10,54,16],[40,10,40,16],[29,10,29,16],[30,10,30,16],[31,10,31,16],[32,10,32,16],[33,10,33,16],[34,10,34,16],[35,10,35,16],[36,10,36,16],[37,10,37,16],[38,10,38,16],[39,10,39,16],[46,10,46,16],[45,10,45,16],[47,10,47,16]]}
["LS Retail Confidential"]
[]
["Bridge to the Cloud 2",null,{"$f":"IF(F5=\"Before September 1, 2022\",(IF(AND(C16>0,C22>0),IF(AND(T16>=0,T21>=0),\"ELIGIBLE FOR BTC2\",\"NOT ELIGIBLE FOR BTC2\"),\"INCOMPLETE DETAILS\")),\"NOT ELIGIBLE\")","v":"INCOMPLETE DETAILS"},null,null,null,null,null,null,null,null,null,null,null,null,null,null,null,null,null,null,null,null,null,null,"Free Users?",{"$f":"IF(AND(Z6=\"YES\",U6=\"ELIGIBLE\"),ROUNDDOWN(IF(B38>0,(U4/S38),(U4/S37)),0),\"NOT ELIGIBLE\")","v":"NOT ELIGIBLE"},null,{"$f":"IF(OR(AA3<0,AA3=\"NOT ELIGIBLE\"),\"*\",\"*estimated number of free users\")","v":"*"}]
[null,null,null,null,null,null,null,null,null,null,null,null,null,null,null,null,null,null,null,"2 Months EP",{"$f":"I22/12*2","v":0}]
["On-premise Perpetual License First Registration Date:",null,null,null,null,"Before September 1, 2022",null,null,null,null,null,null,null,null,null,null,null,null,null,"1 Month NCE cost",{"$f":"(T28)","v":0},null,null,null,null,"Does the license have or has previously licensed concurrent users?"]
[null,null,null,null,null,null,null,null,null,null,null,null,null,null,null,null,null,null,null,null,{"$f":"IF(U5>U4,\"ELIGIBLE\",\"NOT ELIGIBLE\")","v":"NOT ELIGIBLE"},null,null,null,null,"Yes"]
[null,"Subscription Term:","Triennial"]
[null,"Mode of Billing:","Monthly"]
[null,{"$f":"\"Currency:\"","v":"Currency:"},{"$f":"VLOOKUP(C12,V15:W24,2,FALSE)","v":"USD"},null,null,null,null,"Partner discount Subscription/SaaS:"]
[]
{"$rows_left_out":95}
{"sheet":"Change Log ","index":4,"n_rows":10,"n_cols":5,"rows_kept":10,"cut":false,"hidden":true,"merged":[]}
["Price List Change History:"]
[]
[null,"Date","Affected Countries","Type of Change","Summary of Change"]
[null,"2024-03-01","Worldwide","Modules","Added LS Central for pharmacies - W1 localization only, without the country integration"]
[null,"2023-11-15","Worldwide","Prerequisites","The restriction to order only one category of store has been lifted. Customers now have the flexibility to mix purchases from both online and offline stores, provided that the total quantity aligns with the actual number of customer stores."]
[null,"2023-10-01","Worldwide","Modules","Added Self Checkout Connectore Device and Forecourt"]
[null,"2023-09-01","AUD, NZD and CAD","Price Increase","SaaS license price adjustments for local currencies (lsretail.com)"]
[null,"2023-04-01","EU and GB","Price Increase","Following the Local Pricing update announcement from Microsoft"]
[null,"2023-04-01","Worldwide","Changes","New module Analytics added and Activity name changed to Bookings"]
[null,"2023-01-01","Worldwide","Changes","Monthly and Yearly terms combined into 1 sheet"]
{"$rows_left_out":1}
{"sheet":"FactorOld","index":5,"n_rows":241,"n_cols":32,"rows_kept":241,"cut":false,"hidden":true,"merged":[]}
[{"$f":"' Monthly LS Central on BC SaaS'!C4","v":"United States"},{"$f":"VLOOKUP($A1,$A4:$J241,2)","v":"United States"},{"$f":"VLOOKUP($A1,$A4:$J241,3)","v":"NAOM"},{"$f":"VLOOKUP($A1,$A4:$J241,4)","v":1},{"$f":"VLOOKUP($A1,$A4:$J241,5)","v":"USD"},{"$f":"IF(K1,E1,VLOOKUP($A1,$A4:$J241,6))","v":"USD"},{"$f":"VLOOKUP($A1,$A4:$J241,7)","v":1200},{"$f":"VLOOKUP($A1,$A4:$J241,8)","v":1200},{"$f":"IF(K1,D1,VLOOKUP($A1,$A4:$J241,9))","v":1},{"$f":"VLOOKUP($A1,$A4:$J241,10)","v":0},{"$f":"IF(N1=\"EUR\",TRUE,FALSE)","v":false},true,{"$f":"IF(COUNTIF(Lists!H3:H6,VLOOKUP($A1,$A4:$J242,6))=1,VLOOKUP($A1,$A4:$J242,6),\"\")","v":""},"",null,{"$f":"' Monthly LS Central on BC SaaS'!C10","v":"USD"},{"$f":"VLOOKUP(P1,P3:Q6,2,FALSE)","v":1},{"$f":"+' Monthly LS Central on BC SaaS'!C10","v":"USD"},{"$f":"VLOOKUP(R1,R3:S6,2,FALSE)","v":1}]
[null,null,null,null,null,null,null,null,null,null,null,null,{"$f":"IF(COUNTIF(Lists!H3:H6,VLOOKUP($A1,$A4:$J242,6))=1,E1,\"\")","v":""}]
["Country","LS Retail Region","Microsoft region","Factor vegna mism gjaldmiðla","Currencey vegna mis gjaldmiðla","Currency","USD verð","Landa verð","Factor Store",null,null,null,null,null,null,"USD",1,"USD",1]
["Afghanistan","Central Asia","EMEA II",{"$f":"1200/1200","v":1},"USD","USD",1200,1200,{"$f":"H4/G4","v":1},null,null,null,null,null,null,"CAD",{"$f":"+Q12/Q11","v":1.2795918367346939},"CAD",{"$f":"+Q4","v":1.2795918367346939}]
["Albania","Eastern Europe","EMEA II",{"$f":"1200/1200","v":1},"USD","USD",1200,1200,1,null,null,null,null,null,null,"EUR",{"$f":"+Q13/Q11","v":0.84326530612244899},"EUR",{"$f":"+Q5","v":0.84326530612244899}]
["Algeria","Africa","EMEA II",{"$f":"1200/1200","v":1},"USD","USD",1200,1200,1,null,null,null,null,null,null,"GBP",{"$f":"+Q14/Q11","v":0.75408163265306127},"GBP",{"$f":"+Q6","v":0.75408163265306127}]
["American Samoa","APOC United States","APAC I",{"$f":"1200/1200","v":1},"USD","USD",1200,1200,1]
["Andorra","Eurozone","EMEA I",{"$f":"900/1200","v":0.75},"EUR","EUR",1200,900,0.75]
["Angola","Africa","EMEA II",{"$f":"1200/1200","v":1},"USD","USD",1200,1200,1,null,null,null,null,null,null,null,null,null,null,null,null,"Monthly",null,null,null,null,null,"yearly"]
["Anguilla","Latam Caribbean","LATAM I",{"$f":"966/1200","v":0.80500000000000005},"USD","USD",1200,966,0.80500000000000005,null,null,null,null,"list price",null,null,"Essential","Premium","Team member","Device",null,null,"USD","CAD","EUR","GBP",null,null,"USD","CAD","EUR","GBP"]
{"$rows_left_out":232}
{"sheet":"Factor","index":6,"n_rows":241,"n_cols":30,"rows_kept":241,"cut":false,"hidden":true,"merged":[]}
[{"$f":"' Monthly LS Central on BC SaaS'!C4","v":"United States"},{"$f":"VLOOKUP($A1,$A4:$J241,2)","v":"United States"},{"$f":"VLOOKUP($A1,$A4:$J241,3)","v":"NAOM"},{"$f":"VLOOKUP($A1,$A4:$J241,4)","v":1},{"$f":"VLOOKUP($A1,$A4:$J241,5)","v":"USD"},{"$f":"IF(K1,E1,VLOOKUP($A1,$A4:$J241,6))","v":"USD"},{"$f":"VLOOKUP($A1,$A4:$J241,7)","v":1200},{"$f":"VLOOKUP($A1,$A4:$J241,8)","v":1200},{"$f":"IF(K1,D1,VLOOKUP($A1,$A4:$J241,9))","v":1},{"$f":"VLOOKUP($A1,$A4:$J241,10)","v":0},{"$f":"IF(N1=\"EUR\",TRUE,FALSE)","v":false},true,{"$f":"IF(COUNTIF(Lists!H3:H6,VLOOKUP($A1,$A4:$J242,6))=1,VLOOKUP($A1,$A4:$J242,6),\"\")","v":""},"",null,{"$f":"' Monthly LS Central on BC SaaS'!C10","v":"USD"},{"$f":"VLOOKUP(P1,P3:Q6,2,FALSE)","v":1},{"$f":"+' Monthly LS Central on BC SaaS'!C10","v":"USD"},{"$f":"VLOOKUP(R1,R3:S6,2,FALSE)","v":1}]
[null,null,null,null,null,null,null,null,null,null,null,null,{"$f":"IF(COUNTIF(Lists!H3:H6,VLOOKUP($A1,$A4:$J242,6))=1,E1,\"\")","v":""},null,null,{"$f":"'BTC2 Computation'!C9","v":"USD"},{"$f":"VLOOKUP(P1,P3:Q6,2,FALSE)","v":1},{"$f":"'LS Central on BC SaaS edit'!C5","v":"USD"},{"$f":"VLOOKUP(R1,R3:S6,2,FALSE)","v":1}]
["Country","LS Retail Region","Microsoft region","Factor vegna mism gjaldmiðla","Currencey vegna mis gjaldmiðla","Currency","USD verð","Landa verð","Factor Store",null,null,null,null,null,null,"USD",1,"USD",1]
["Afghanistan","Central Asia","EMEA II",{"$f":"1200/1200","v":1},"USD","USD",1200,1200,{"$f":"H4/G4","v":1},null,null,null,null,null,null,"CAD",{"$f":"+Q12/Q11","v":1.2795918367346939},"CAD",{"$f":"+Q4","v":1.2795918367346939}]
["Albania","Eastern Europe","EMEA II",{"$f":"1200/1200","v":1},"USD","USD",1200,1200,1,null,null,null,null,null,null,"EUR",{"$f":"+Q13/Q11","v":0.84326530612244899},"EUR",{"$f":"+Q5","v":0.84326530612244899}]
["Algeria","Africa","EMEA II",{"$f":"1200/1200","v":1},"USD","USD",1200,1200,1,null,null,null,null,null,null,"GBP",{"$f":"+Q14/Q11","v":0.75408163265306127},"GBP",{"$f":"+Q6","v":0.75408163265306127}]
["American Samoa","APOC United States","APAC I",{"$f":"1200/1200","v":1},"USD","USD",1200,1200,1]
["Andorra","Eurozone","EMEA I",{"$f":"900/1200","v":0.75},"EUR","EUR",1200,900,0.75]
["Angola","Africa","EMEA II",{"$f":"1200/1200","v":1},"USD","USD",1200,1200,1]
["Anguilla","Latam Caribbean","LATAM I",{"$f":"966/1200","v":0.80500000000000005},"USD","USD",1200,966,0.80500000000000005,null,null,null,null,"list price",null,null,"Essential","Premium","Team member","Device Cost","Device Selling",null,null,"usd","cad","eur","gbp"]
{"$rows_left_out":232}
{"sheet":"Price List","index":7,"n_rows":141,"n_cols":31,"rows_kept":141,"cut":false,"hidden":true,"merged":[[0,27,0,30],[0,12,0,21]]}
[null,null,"SKU","USD","CAD","EUR","GBP","AUD","NZD",null,null,null,"MS pricelist",null,null,null,null,null,null,null,null,null,null,null,null,null,null,"Should receive these prices in the future once Embed is ready"]
[null,null,null,null,{"$f":"1.28*1.06","v":1.3568},0.85,0.76,{"$f":"1.373*1.09","v":1.4965700000000002},{"$f":"1.52*1.07","v":1.6264000000000001},null,null,null,null,null,"USD","USD","CAD","CAD","EUR","EUR","GBP","GBP","AUD","AUD","NZD","NZD",null,"USD","CAD","EUR","GBP"]
[null,"ERP Users",null,null,null,null,null,null,null,null,null,null,"Offer Display Name","Offer ID","List Price","ERP Price","List Price","ERP Price","List Price","ERP Price","List Price","ERP Price","List Price","ERP Price","List Price","ERP Price",null,"LS Retail price","LS Retail price","LS Retail price","LS Retail price"]
[null,"Dynamics 365 Business Central Essential","BC-D365-SAAS-E",84,{"$f":"+D4*$E$2","v":113.9712},{"$f":"+D4*$F$2*1.11","v":79.253999999999991},{"$f":"+D4*$G$2*1.09","v":69.585600000000014},{"$f":"+D4*$H$2","v":125.71188000000001},{"$f":"D4*$I$2","v":136.61760000000001},null,null,null,"Dynamics 365 Business Central Essential","70ec2332-e230-4c53-837d-75dfb54cefe8",{"$f":"+FactorOld!Q11","v":49},{"$f":"+FactorOld!W22","v":70},62.72,89.6,{"$f":"+FactorOld!Y11","v":45.865200000000002},{"$f":"+FactorOld!Y22","v":65.490000000000009},{"$f":"+FactorOld!Z11","v":37},{"$f":"+FactorOld!Z22","v":52.8},67.3,96.1,74.099999999999994,105.8,null,{"$f":"P4*(1-0.5)","v":35},{"$f":"Q4*(1-0.5)","v":31.36},{"$f":"R4*(1-0.5)","v":44.8},{"$f":"S4*(1-0.5)","v":22.932600000000001}]
[null,"Dynamics 365 Business Central Premium","BC-D365-SAAS-P",120,{"$f":"+D5*$E$2","v":162.816},113.22000000000001,99.408000000000015,{"$f":"+D5*$H$2","v":179.58840000000004},{"$f":"D5*$I$2","v":195.16800000000001},null,null,null,"Dynamics 365 Business Central Premium","C9F0BDF2-3679-4F9A-8E69-0DC52C5E9E52",{"$f":"+FactorOld!W12","v":70},{"$f":"+FactorOld!W23","v":100},89.6,128,{"$f":"+FactorOld!Y12","v":65.523300000000006},{"$f":"+FactorOld!Y23","v":93.573000000000008},{"$f":"+FactorOld!Z12","v":52.78},{"$f":"+FactorOld!Z23","v":75.400000000000006},96.1,137.30000000000001,105.8,151.19999999999999,null,{"$f":"P5*(1-0.5)","v":50},44.8,64,32.761650000000003]
[null,"Dynamics 365 Business Central Team Member","BC-D365-SAAS-TM",9.6,13.02528,9.0576000000000008,7.9526399999999997,14.367072000000002,15.613440000000001,null,null,null,"Dynamics 365 Business Central Team Member","70DE61E8-402B-4665-B80E-97FC39323B81",{"$f":"+FactorOld!W13","v":5.6},{"$f":"+FactorOld!W24","v":8},7.17,10.199999999999999,{"$f":"+FactorOld!Y13","v":5.2503000000000011},{"$f":"+FactorOld!Y24","v":7.548},{"$f":"+FactorOld!Z13","v":4.22},{"$f":"+FactorOld!Z24","v":6},7.7,11,8.5,12.1,null,4,{"$f":"Q6*(1-0.5)","v":3.585},5.0999999999999996,2.6251500000000005]
[null,"Dynamics 365 Business Central External Accountant","BC-D365-SAAS-EA",0,0,0,0,0,0,null,null,null,"Dynamics 365 Business Central External Accountant","88F9EB8A-0636-45E8-A601-553E0A48AA9E",0,0,0,0,0,0,0,0,0,0,0,0,null,0,{"$f":"Q7*(1-0.5)","v":0},0,0]
[null,"Dynamics 365 Business Central Sales Professional attach","BC-D365-SAAS-SPA",24,32.563200000000002,22.644000000000002,19.881600000000002,35.917680000000004,39.0336,null,null,null,"Dynamics 365 Sales Professional Attach to Qualifying Dynamics 365 Base Offer","62ba2336-d7be-4339-9a52-727e7cc7c0fe",15,20]
[null,"Dynamics 365 Business Central Customer Service Professional attach","BC-D365-SAAS-CSPA",24,32.563200000000002,22.644000000000002,19.881600000000002,35.917680000000004,39.0336,null,null,null,"Dynamics 365 Customer Service Professional Attach to Qualifying Dynamics 365 Base Offer","41791076-9613-40e3-b1c4-7ba8c2c95e60",15,20]
[null,"Yearly",null,null,null,null,null,null,0,null,null,null,null,null,null,null,null,null,null,null,null,null,null,null,null,null,null,{"$f":"P7*(1-0.5)","v":0},{"$f":"Q7*(1-0.5)","v":0},{"$f":"R7*(1-0.5)","v":0},{"$f":"S7*(1-0.5)","v":0}]
{"$rows_left_out":132}
{"sheet":"Lists","index":8,"n_rows":90,"n_cols":14,"rows_kept":90,"cut":false,"hidden":true,"merged":[]}
[]
[null,"OrderType",null,null,null,null,null,"Currency List",null,null,"Link To Existing SaaS Active Directory"]
[null,"New License",null,null,null,null,null,"AUD",null,null,"Yes"]
[null,"Additional modules",null,null,null,null,null,"CAD",null,null,"No"]
[null,null,null,null,null,null,null,"DKK"]
[null,null,null,null,null,null,null,"EUR",null,null,null,null,null,"If yes, <existing AAD Name>"]
[null,null,null,null,null,null,null,"GBP",null,null,null,null,null,"If no, <preferred AAD Name>"]
[null,null,null,null,null,null,null,"INR"]
[null,null,null,null,null,null,null,"NOK"]
[null,null,null,null,null,null,null,"NZD"]
{"$rows_left_out":81}
{"sheet":"Change Log","index":9,"n_rows":3,"n_cols":5,"rows_kept":3,"cut":false,"hidden":true,"merged":[]}
["Pricelist Change History:"]
[]
[null,"Date","Affected Countries","Type of Change","Summary of Change"]